rm -rf src/Engine/Model/* && \
cp /home/ss/Verdict/Client/Networks/EFB69E5C src/Engine/Model/
[*] Performing initial build for profiling...
cmake -B Build -G Ninja \
-DCMAKE_BUILD_TYPE=Release \
-DCMAKE_C_COMPILER=cc \
-DCMAKE_CXX_COMPILER=clang++ \
-DBUILD_PGO=ON
-- The C compiler identification is GNU 13.3.0
-- The CXX compiler identification is Clang 20.1.7
-- Detecting C compiler ABI info
-- Detecting C compiler ABI info - done
-- Check for working C compiler: /usr/bin/cc - skipped
-- Detecting C compile features
-- Detecting C compile features - done
-- Detecting CXX compiler ABI info
-- Detecting CXX compiler ABI info - done
-- Check for working CXX compiler: /usr/bin/clang++ - skipped
-- Detecting CXX compile features
-- Detecting CXX compile features - done
fatal: not a git repository (or any of the parent directories): .git
CMake Warning at CMakeLists.txt:33 (message):
Could not get hash. Is this a Git repository?
-- Building StockDory unknown (Piranha)
-- PGO: No profile data found, adding profiling steps to the build...
-- Setting CPM.cmake location to /tmp/tmptk_h36m_/StockDory/StockDory-tmp/Build/cmake/CPM_0.40.8.cmake
-- CPM.cmake was not found at /tmp/tmptk_h36m_/StockDory/StockDory-tmp/Build/cmake/CPM_0.40.8.cmake
-- Attempt: 1/3: Downloading CPM.cmake...
-- CPM.cmake was found at /tmp/tmptk_h36m_/StockDory/StockDory-tmp/Build/cmake/CPM_0.40.8.cmake
-- CPM: Adding package MantaRay@0 (079959294e5c2b0c62e50f9222812d6f21014932)
-- Setting CPM.cmake location to /tmp/tmptk_h36m_/StockDory/StockDory-tmp/Build/_deps/mantaray-build/cmake/CPM_0.40.8.cmake
-- CPM.cmake was not found at /tmp/tmptk_h36m_/StockDory/StockDory-tmp/Build/_deps/mantaray-build/cmake/CPM_0.40.8.cmake
-- Attempt: 1/3: Downloading CPM.cmake...
-- CPM.cmake was found at /tmp/tmptk_h36m_/StockDory/StockDory-tmp/Build/_deps/mantaray-build/cmake/CPM_0.40.8.cmake
-- CPM: Adding package nanothread@ (master)
-- nanothread: targeting the native CPU architecture (specify NANOTHREAD_NATIVE_FLAGS to change this).
-- Flags: -flto=full -mno-avx512vnni -march=native -mtune=native -fprofile-instr-generate=/tmp/tmptk_h36m_/StockDory/StockDory-tmp/Build/pgo.profraw | -O3 -DNDEBUG
-- Configuring done (5.9s)
-- Generating done (0.0s)
-- Build files have been written to: /tmp/tmptk_h36m_/StockDory/StockDory-tmp/Build
cmake --build Build --config Release
[1/5] Building CXX object _deps/nanothread-build/CMakeFiles/nanothread.dir/src/queue.cpp.o
[2/5] Building CXX object _deps/nanothread-build/CMakeFiles/nanothread.dir/src/nanothread.cpp.o
[3/5] Linking CXX static library _deps/nanothread-build/libnanothread.a
[4/5] Building CXX object CMakeFiles/StockDory.dir/src/main.cpp.o
FAILED: CMakeFiles/StockDory.dir/src/main.cpp.o
/usr/bin/clang++ -DNANOTHREAD_STATIC -I/tmp/tmptk_h36m_/StockDory/StockDory-tmp/Build/BuildSystem -I/tmp/tmptk_h36m_/StockDory/StockDory-tmp/Build/_deps/mantaray-src/include -I/tmp/tmptk_h36m_/StockDory/StockDory-tmp/Build/_deps/nanothread-src/include -flto=full -mno-avx512vnni -march=native -mtune=native -fprofile-instr-generate=/tmp/tmptk_h36m_/StockDory/StockDory-tmp/Build/pgo.profraw -O3 -DNDEBUG -std=gnu++23 -MD -MT CMakeFiles/StockDory.dir/src/main.cpp.o -MF CMakeFiles/StockDory.dir/src/main.cpp.o.d -o CMakeFiles/StockDory.dir/src/main.cpp.o -c /tmp/tmptk_h36m_/StockDory/StockDory-tmp/src/main.cpp
In file included from /tmp/tmptk_h36m_/StockDory/StockDory-tmp/src/main.cpp:10:
In file included from /tmp/tmptk_h36m_/StockDory/StockDory-tmp/src/Terminal/BenchHash.h:13:
In file included from /tmp/tmptk_h36m_/StockDory/StockDory-tmp/src/Terminal/../Engine/Search.h:13:
In file included from /tmp/tmptk_h36m_/StockDory/StockDory-tmp/src/Terminal/../Engine/../Backend/Board.h:32:
In file included from /tmp/tmptk_h36m_/StockDory/StockDory-tmp/src/Terminal/../Engine/../Backend/../Engine/Evaluation.h:15:
In file included from /tmp/tmptk_h36m_/StockDory/StockDory-tmp/src/Terminal/../Engine/../Backend/../Engine/NetworkArchitecture.h:9:
In file included from /tmp/tmptk_h36m_/StockDory/StockDory-tmp/Build/_deps/mantaray-src/include/MantaRay/Backend/Kernel/Activation/ClippedReLU.h:9:
/tmp/tmptk_h36m_/StockDory/StockDory-tmp/Build/_deps/mantaray-src/include/MantaRay/Backend/Kernel/Activation/../../Processor.h:14:9: warning: 'UNROLL' macro redefined [-Wmacro-redefined]
14 | #define UNROLL PRAGMA_CALL(unroll )
| ^
/tmp/tmptk_h36m_/StockDory/StockDory-tmp/Build/_deps/mantaray-src/include/MantaRay/Backend/Kernel/Activation/../../Processor.h:13:9: note: previous definition is here
13 | #define UNROLL(x) PRAGMA_CALL(unroll x)
| ^
In file included from /tmp/tmptk_h36m_/StockDory/StockDory-tmp/src/main.cpp:10:
In file included from /tmp/tmptk_h36m_/StockDory/StockDory-tmp/src/Terminal/BenchHash.h:13:
In file included from /tmp/tmptk_h36m_/StockDory/StockDory-tmp/src/Terminal/../Engine/Search.h:13:
In file included from /tmp/tmptk_h36m_/StockDory/StockDory-tmp/src/Terminal/../Engine/../Backend/Board.h:32:
/tmp/tmptk_h36m_/StockDory/StockDory-tmp/src/Terminal/../Engine/../Backend/../Engine/Evaluation.h:16:10: fatal error: 'Model/NeuralNetworkBinary.h' file not found
16 | #include "Model/NeuralNetworkBinary.h"
| ^~~~~~~~~~~~~~~~~~~~~~~~~~~~~
1 warning and 1 error generated.
ninja: build stopped: subcommand failed.
make: *** [Makefile:38: openbench] Error 1